BDBM50037778 CHEMBL3358192
SMILES O=Cc1cc2cnccc2s1
InChI Key InChIKey=WLWWQVDSQWYRIV-UHFFFAOYSA-N
Data  2 KI  1 IC50
  Tab Delimited (TSV)   2D SDfile   Computed 3D by Vconf -m prep SDfile
Find this compound or compounds like it in BindingDB:
Activity Spreadsheet -- Enzyme Inhibition Constant Data from BindingDB
Found 3 hits for monomerid = 50037778
TargetCytochrome P450 2A6(Homo sapiens (Human))
University Of Eastern Finland
Curated by ChEMBL
LigandPNGBDBM50037778(CHEMBL3358192)
Affinity DataKi:  70nM. Assay description: Inhibition of human CYP2A6 in baculovirus-infected insect cell system using coumarin 7 as substrate preincubated for 10 mins by fluorescence assay
In DepthDetails ArticlePubMed
TargetCytochrome P450 2A6(Homo sapiens (Human))
University Of Eastern Finland
Curated by ChEMBL
LigandPNGBDBM50037778(CHEMBL3358192)
Affinity DataKi:  1.10E+3nM. Assay description: Competitive inhibition of human CYP2A6 in baculovirus-infected insect cell system assessed as nicotine metabolism after 15 mins
In DepthDetails ArticlePubMed
TargetCytochrome P450 2A6(Homo sapiens (Human))
University Of Eastern Finland
Curated by ChEMBL
LigandPNGBDBM50037778(CHEMBL3358192)
Affinity DataIC50:  300nM. Assay description: Inhibition of human CYP2A6 in baculovirus-infected insect cell system using coumarin 7 as substrate preincubated for 10 mins by fluorescence assay
In DepthDetails ArticlePubMed