BDBM50037779 CHEMBL3358215
SMILES O=Cc1ccc2occc2c1
InChI Key InChIKey=LLLBDLDNTMMZHL-UHFFFAOYSA-N
Data  3 KI  2 IC50
  Tab Delimited (TSV)   2D SDfile   Computed 3D by Vconf -m prep SDfile
Find this compound or compounds like it in BindingDB:
Activity Spreadsheet -- Enzyme Inhibition Constant Data from BindingDB
Found 5 hits for monomerid = 50037779
TargetCytochrome P450 2A6(Homo sapiens (Human))
University Of Eastern Finland
Curated by ChEMBL
LigandPNGBDBM50037779(CHEMBL3358215)
Affinity DataKi:  70nM. Assay description: Inhibition of human CYP2A6 in baculovirus-infected insect cell system using coumarin 7 as substrate preincubated for 10 mins by fluorescence assay
In DepthDetails ArticlePubMed
TargetCytochrome P450 2A6(Homo sapiens (Human))
University Of Eastern Finland
Curated by ChEMBL
LigandPNGBDBM50037779(CHEMBL3358215)
Affinity DataKi:  2.40E+3nM. Assay description: Irreversible inhibition of human CYP2A6 in baculovirus-infected insect cell system using coumarin 7 as substrate incubated for 10 mins by fluorescenc...
In DepthDetails ArticlePubMed
TargetCytochrome P450 2A6(Homo sapiens (Human))
University Of Eastern Finland
Curated by ChEMBL
LigandPNGBDBM50037779(CHEMBL3358215)
Affinity DataKi:  5.50E+3nM. Assay description: Competitive inhibition of human CYP2A6 in baculovirus-infected insect cell system assessed as nicotine metabolism after 15 mins
In DepthDetails ArticlePubMed
TargetCytochrome P450 2A6(Homo sapiens (Human))
University Of Eastern Finland
Curated by ChEMBL
LigandPNGBDBM50037779(CHEMBL3358215)
Affinity DataIC50:  400nM. Assay description: Inhibition of human CYP2A6 in baculovirus-infected insect cell system using coumarin 7 as substrate preincubated for 10 mins by fluorescence assay
In DepthDetails ArticlePubMed
TargetCytochrome P450 2A6(Homo sapiens (Human))
University Of Eastern Finland
Curated by ChEMBL
LigandPNGBDBM50037779(CHEMBL3358215)
Affinity DataIC50:  50nM. Assay description: Inhibition of human CYP2A6 in baculovirus-infected insect cell system using coumarin 7 as substrate incubated for 30 mins prior to substrate addition...
In DepthDetails ArticlePubMed