BDBM50038004 CHEMBL3359412
SMILES O=c1n(Cc2ccccc2)nc(C2CCC2)c2c3cc(nn3cnc12)-c1ccccc1
InChI Key InChIKey=VMOSPBUWZZRALU-UHFFFAOYSA-N
Data  2 KI
  Tab Delimited (TSV)   2D SDfile   Computed 3D by Vconf -m prep SDfile
Find this compound or compounds like it in BindingDB:
Activity Spreadsheet -- Enzyme Inhibition Constant Data from BindingDB
Found 2 hits for monomerid = 50038004
TargetAdenosine receptor A1(Homo sapiens (Human))
Universit£
Curated by ChEMBL
LigandPNGBDBM50038004(CHEMBL3359412)
Affinity DataKi:  1.90nM. Assay description: Displacement of [3H]DPCPX from human adenosine A1 receptor expressed in CHO cells after 120 mins
In DepthDetails ArticlePubMed
TargetAdenosine receptor A3(Homo sapiens (Human))
Universit£
Curated by ChEMBL
LigandPNGBDBM50038004(CHEMBL3359412)
Affinity DataKi:  193nM. Assay description: Displacement of [125I]AB-MECA from human adenosine A3 receptor expressed in CHO cells after 120 mins
In DepthDetails ArticlePubMed