BDBM50038716 1-(4-Chloro-phenyl)-cyclopentanecarboxylic acid 2-(4-phenyl-piperazin-1-yl)-ethyl ester; hydrochloride::CHEMBL539245
SMILES Clc1ccc(cc1)C1(CCCC1)C(=O)OCCN1CCN(CC1)c1ccccc1
InChI Key InChIKey=SFWLRQJIBUQSPD-UHFFFAOYSA-N
Data  1 KI
  Tab Delimited (TSV)   2D SDfile   Computed 3D by Vconf -m prep SDfile
Find this compound or compounds like it in BindingDB:
Activity Spreadsheet -- Enzyme Inhibition Constant Data from BindingDB
Found 1 hit for monomerid = 50038716
TargetSigma non-opioid intracellular receptor 1(Homo sapiens (Human))
Albany Molecular Research
Curated by ChEMBL
LigandPNGBDBM50038716(1-(4-Chloro-phenyl)-cyclopentanecarboxylic acid 2-...)
Affinity DataKi:  77nM. Assay description: Affinity at sigma-1 site by inhibition of [3H](+)-pentazocine (PENT) binding in guinea pig brain
In DepthDetails ArticlePubMed