BDBM50038842 2-(1,3-benzothiazol-2-ylmethyl)-6-fluoro-1H,2'H,5'H-spiro[isoquinoline-4,3'-pyrrol::CHEMBL64543
SMILES Fc1ccc2C(=O)N(Cc3nc4ccccc4s3)C(=O)C3(CC(=O)NC3=O)c2c1
InChI Key InChIKey=IJVJNSXFQMPOLT-UHFFFAOYSA-N
Data  1 IC50
  Tab Delimited (TSV)   2D SDfile   Computed 3D by Vconf -m prep SDfile
Find this compound or compounds like it in BindingDB:
Activity Spreadsheet -- Enzyme Inhibition Constant Data from BindingDB
Found 1 hit for monomerid = 50038842
TargetAldo-keto reductase family 1 member B1 [K65Q](Bos taurus (Cattle))
Wyeth-Ayerst Research
Curated by ChEMBL
LigandPNGBDBM50038842(2-(1,3-benzothiazol-2-ylmethyl)-6-fluoro-1H,2'H,5'...)
Affinity DataIC50:  18nM. Assay description: In vitro inhibition of aldose reductase activity in a partially purified bovine lens preparationChecked by Author
In DepthDetails ArticlePubMed