BDBM50038923 1-[4-(2-Chloro-phenyl)-6,7-dimethyl-quinolin-3-yl]-3-(2,4-difluoro-phenyl)-urea::CHEMBL64976
SMILES Cc1cc2ncc(NC(=O)Nc3ccc(F)cc3F)c(-c3ccccc3Cl)c2cc1C
InChI Key InChIKey=FFKNNBNIAHVVCU-UHFFFAOYSA-N
Data  1 IC50
  Tab Delimited (TSV)   2D SDfile   Computed 3D by Vconf -m prep SDfile
Find this compound or compounds like it in BindingDB:
Activity Spreadsheet -- Enzyme Inhibition Constant Data from BindingDB
Found 1 hit for monomerid = 50038923
TargetSterol O-acyltransferase 1(Rattus norvegicus)
Takeda Chemical Industries
Curated by ChEMBL
LigandPNGBDBM50038923(1-[4-(2-Chloro-phenyl)-6,7-dimethyl-quinolin-3-yl]...)
Affinity DataIC50:  5.80nM. Assay description: Inhibitory activity against acyl coenzyme A:cholesterol acyltransferase in rat microsomes
In DepthDetails ArticlePubMed