BDBM50038950 CHEMBL303188::[2-(4-Sulfamoyl-benzoylamino)-acetylamino]-acetic acid benzyl ester
SMILES NS(=O)(=O)c1ccc(cc1)C(=O)NCC(=O)NCC(=O)OCc1ccccc1
InChI Key InChIKey=GCPBYTWWBHXMDF-UHFFFAOYSA-N
Data  1 Kd
  Tab Delimited (TSV)   2D SDfile   Computed 3D by Vconf -m prep SDfile
Find this compound or compounds like it in BindingDB:
Activity Spreadsheet -- Enzyme Inhibition Constant Data from BindingDB
Found 1 hit for monomerid = 50038950
TargetCarbonic anhydrase 2(Homo sapiens (Human))
Harvard University
Curated by ChEMBL
LigandPNGBDBM50038950(CHEMBL303188 | [2-(4-Sulfamoyl-benzoylamino)-acety...)
Affinity DataKd:  71nM. Assay description: Dissociation constant against human Carbonic anhydrase II (HCA II)
In DepthDetails ArticlePubMed