BDBM50038972 CHEMBL304720::{2-[2-(4-Sulfamoyl-benzoylamino)-acetylamino]-acetylamino}-acetic acid 4-butyl-benzyl ester
SMILES CCCCc1ccc(COC(=O)CNC(=O)CNC(=O)CNC(=O)c2ccc(cc2)S(N)(=O)=O)cc1
InChI Key InChIKey=CYACTKCAWJIQBE-UHFFFAOYSA-N
Data  1 Kd
  Tab Delimited (TSV)   2D SDfile   Computed 3D by Vconf -m prep SDfile
Find this compound or compounds like it in BindingDB:
Activity Spreadsheet -- Enzyme Inhibition Constant Data from BindingDB
Found 1 hit for monomerid = 50038972
TargetCarbonic anhydrase 2(Homo sapiens (Human))
Harvard University
Curated by ChEMBL
LigandPNGBDBM50038972(CHEMBL304720 | {2-[2-(4-Sulfamoyl-benzoylamino)-ac...)
Affinity DataKd:  53nM. Assay description: Dissociation constant against human Carbonic anhydrase II (HCA II)
In DepthDetails ArticlePubMed