BDBM50038984 4-[(Benzo[1,3]dioxol-5-ylmethyl)-amino]-quinazoline-6-carboxylic acid::CHEMBL304275
SMILES OC(=O)c1ccc2ncnc(NCc3ccc4OCOc4c3)c2c1
InChI Key InChIKey=RGIVCFXZRQYLBY-UHFFFAOYSA-N
Data  1 IC50
  Tab Delimited (TSV)   2D SDfile   Computed 3D by Vconf -m prep SDfile
Find this compound or compounds like it in BindingDB:
Activity Spreadsheet -- Enzyme Inhibition Constant Data from BindingDB
Found 1 hit for monomerid = 50038984
TargetcGMP-specific 3',5'-cyclic phosphodiesterase(Homo sapiens (Human))
Eisai
Curated by ChEMBL
LigandPNGBDBM50038984(4-[(Benzo[1,3]dioxol-5-ylmethyl)-amino]-quinazolin...)
Affinity DataIC50:  7.50E+3nM. Assay description: Inhibitory activity against cGMP-phosphodiesterase from porcine aorta
In DepthDetails ArticlePubMed