BDBM50038987 4-(Benzo[1,3]dioxol-5-ylmethoxy)-6-methylsulfanyl-quinazoline::CHEMBL68448
SMILES CSc1ccc2ncnc(OCc3ccc4OCOc4c3)c2c1
InChI Key InChIKey=XBZAWJVQORGHFE-UHFFFAOYSA-N
Data  1 IC50
  Tab Delimited (TSV)   2D SDfile   Computed 3D by Vconf -m prep SDfile
Find this compound or compounds like it in BindingDB:
Activity Spreadsheet -- Enzyme Inhibition Constant Data from BindingDB
Found 1 hit for monomerid = 50038987
TargetcGMP-specific 3',5'-cyclic phosphodiesterase(Homo sapiens (Human))
Eisai
Curated by ChEMBL
LigandPNGBDBM50038987(4-(Benzo[1,3]dioxol-5-ylmethoxy)-6-methylsulfanyl-...)
Affinity DataIC50:  1.40E+3nM. Assay description: Inhibitory activity against cGMP-phosphodiesterase from porcine aorta
In DepthDetails ArticlePubMed