BDBM50038989 Benzo[1,3]dioxol-5-ylmethyl-(6,8-dimethoxy-quinazolin-4-yl)-amine::CHEMBL68072
SMILES COc1cc(OC)c2ncnc(NCc3ccc4OCOc4c3)c2c1
InChI Key InChIKey=OSKUZWKBJAUIEL-UHFFFAOYSA-N
Data  1 IC50
  Tab Delimited (TSV)   2D SDfile   Computed 3D by Vconf -m prep SDfile
Find this compound or compounds like it in BindingDB:
Activity Spreadsheet -- Enzyme Inhibition Constant Data from BindingDB
Found 1 hit for monomerid = 50038989
TargetcGMP-specific 3',5'-cyclic phosphodiesterase(Homo sapiens (Human))
Eisai
Curated by ChEMBL
LigandPNGBDBM50038989(Benzo[1,3]dioxol-5-ylmethyl-(6,8-dimethoxy-quinazo...)
Affinity DataIC50:  810nM. Assay description: Inhibitory activity against cGMP-phosphodiesterase from porcine aorta
In DepthDetails ArticlePubMed