BDBM50039201 3-(1-(4-chlorobenzyl)piperidin-4-yl)-1-(indolin-5-yl)propan-1-one::3-[1-(4-Chloro-benzyl)-piperidin-4-yl]-1-(2,3-dihydro-1H-indol-5-yl)-propan-1-one::CHEMBL75649
SMILES Clc1ccc(CN2CCC(CCC(=O)c3ccc4NCCc4c3)CC2)cc1
InChI Key InChIKey=NLEPKGFELHYOOA-UHFFFAOYSA-N
Data  2 IC50
  Tab Delimited (TSV)   2D SDfile   Computed 3D by Vconf -m prep SDfile
Find this compound or compounds like it in BindingDB:
Activity Spreadsheet -- Enzyme Inhibition Constant Data from BindingDB
Found 2 hits for monomerid = 50039201
TargetAcetylcholinesterase(Homo sapiens (Human))
Sichuan University
Curated by ChEMBL
LigandPNGBDBM50039201(3-(1-(4-chlorobenzyl)piperidin-4-yl)-1-(indolin-5-...)
Affinity DataIC50:  6.36E+3nM. Assay description: Inhibition of AChE
In DepthDetails ArticlePubMed
TargetAcetylcholinesterase(Rattus norvegicus (rat))
Takeda Chemical Industries
Curated by ChEMBL
LigandPNGBDBM50039201(3-(1-(4-chlorobenzyl)piperidin-4-yl)-1-(indolin-5-...)
Affinity DataIC50:  6.36E+3nM. Assay description: Inhibition of acetylcholinesterase (AChE)
In DepthDetails ArticlePubMed