BDBM50039217 1-(2,3-Dihydro-1H-indol-5-yl)-3-[1-(3-methoxy-benzyl)-piperidin-4-yl]-propan-1-one::1-(indolin-5-yl)-3-(1-(3-methoxybenzyl)piperidin-4-yl)propan-1-one::CHEMBL73447
SMILES COc1cccc(CN2CCC(CCC(=O)c3ccc4NCCc4c3)CC2)c1
InChI Key InChIKey=OQUGQBUZOCXPCA-UHFFFAOYSA-N
Data  2 IC50
  Tab Delimited (TSV)   2D SDfile   Computed 3D by Vconf -m prep SDfile
Find this compound or compounds like it in BindingDB:
Activity Spreadsheet -- Enzyme Inhibition Constant Data from BindingDB
Found 2 hits for monomerid = 50039217
TargetAcetylcholinesterase(Homo sapiens (Human))
Sichuan University
Curated by ChEMBL
LigandPNGBDBM50039217(1-(2,3-Dihydro-1H-indol-5-yl)-3-[1-(3-methoxy-benz...)
Affinity DataIC50:  2.68E+3nM. Assay description: Inhibition of AChE
In DepthDetails ArticlePubMed
TargetAcetylcholinesterase(Rattus norvegicus (rat))
Takeda Chemical Industries
Curated by ChEMBL
LigandPNGBDBM50039217(1-(2,3-Dihydro-1H-indol-5-yl)-3-[1-(3-methoxy-benz...)
Affinity DataIC50:  2.68E+3nM. Assay description: Inhibition of acetylcholinesterase (AChE)
In DepthDetails ArticlePubMed