BDBM50039222 3-(1-Benzyl-piperidin-4-yl)-1-(1-butyl-2,3-dihydro-1H-indol-5-yl)-propan-1-one::3-(1-benzylpiperidin-4-yl)-1-(1-butylindolin-5-yl)propan-1-one::CHEMBL74922
SMILES CCCCN1CCc2cc(ccc12)C(=O)CCC1CCN(Cc2ccccc2)CC1
InChI Key InChIKey=OXEYNPROGKVXDG-UHFFFAOYSA-N
Data  2 IC50
  Tab Delimited (TSV)   2D SDfile   Computed 3D by Vconf -m prep SDfile
Find this compound or compounds like it in BindingDB:
Activity Spreadsheet -- Enzyme Inhibition Constant Data from BindingDB
Found 2 hits for monomerid = 50039222
TargetAcetylcholinesterase(Homo sapiens (Human))
Sichuan University
Curated by ChEMBL
LigandPNGBDBM50039222(3-(1-Benzyl-piperidin-4-yl)-1-(1-butyl-2,3-dihydro...)
Affinity DataIC50:  29nM. Assay description: Inhibition of AChE
In DepthDetails ArticlePubMed
TargetAcetylcholinesterase(Rattus norvegicus (rat))
Takeda Chemical Industries
Curated by ChEMBL
LigandPNGBDBM50039222(3-(1-Benzyl-piperidin-4-yl)-1-(1-butyl-2,3-dihydro...)
Affinity DataIC50:  29nM. Assay description: Inhibition of acetylcholinesterase (AChE)
In DepthDetails ArticlePubMed