BDBM50039294 (1S,9aR,11aS)-9a,11a-Dimethyl-7-oxo-2,3,3a,3b,4,5,7,8,9,9a,9b,10,11,11a-tetradecahydro-1H-cyclopenta[i]phenanthridine-1-carboxylic acid [bis-(4-fluoro-phenyl)-methyl]-amide::9a,11a-Dimethyl-7-oxo-2,3,3a,3b,4,5,7,8,9,9a,9b,10,11,11a-tetradecahydro-1H-cyclopenta[i]phenanthridine-1-carboxylic acid [bis-(4-fluoro-phenyl)-methyl]-amide::CHEMBL306722
SMILES C[C@]12CCC3C(CN=C4CC(=O)CC[C@]34C)C1CC[C@@H]2C(=O)NC(c1ccc(F)cc1)c1ccc(F)cc1
InChI Key InChIKey=UVABKAVBEXEPJC-XXRHFDIKSA-N
Data  2 KI  2 IC50
  Tab Delimited (TSV)   2D SDfile   Computed 3D by Vconf -m prep SDfile
Find this compound or compounds like it in BindingDB:
Activity Spreadsheet -- Enzyme Inhibition Constant Data from BindingDB
Found 4 hits for monomerid = 50039294
Target3-oxo-5-alpha-steroid 4-dehydrogenase 1(Homo sapiens (Human))
Glaxo Inc. Research Institute
Curated by ChEMBL
LigandPNGBDBM50039294((1S,9aR,11aS)-9a,11a-Dimethyl-7-oxo-2,3,3a,3b,4,5,...)
Affinity DataKi:  20nM. Assay description: Inhibition of recombinant human 5-alpha reductase-1 at a concentration of 5 microL after preincubation for 10 minutes
In DepthDetails ArticlePubMed
Target3-oxo-5-alpha-steroid 4-dehydrogenase 1(Homo sapiens (Human))
Glaxo Inc. Research Institute
Curated by ChEMBL
LigandPNGBDBM50039294((1S,9aR,11aS)-9a,11a-Dimethyl-7-oxo-2,3,3a,3b,4,5,...)
Affinity DataKi:  20nM. Assay description: In vitro inhibitory activity against human type 1 5-alpha reductase
In DepthDetails ArticlePubMed
Target3-oxo-5-alpha-steroid 4-dehydrogenase 2(Homo sapiens (Human))
Glaxo Inc. Research Institute
Curated by ChEMBL
LigandPNGBDBM50039294((1S,9aR,11aS)-9a,11a-Dimethyl-7-oxo-2,3,3a,3b,4,5,...)
Affinity DataIC50:  0.160nM. Assay description: In vitro inhibitory activity against human type 2 5-alpha reductase
In DepthDetails ArticlePubMed
Target3-oxo-5-alpha-steroid 4-dehydrogenase 2(Homo sapiens (Human))
Glaxo Inc. Research Institute
Curated by ChEMBL
LigandPNGBDBM50039294((1S,9aR,11aS)-9a,11a-Dimethyl-7-oxo-2,3,3a,3b,4,5,...)
Affinity DataIC50:  0.160nM. Assay description: Inhibition of recombinant human 5-alpha reductase-2 at a concentration of 5 microL after preincubation for 10 minutes
In DepthDetails ArticlePubMed