BDBM50039880 4'-[3-Butyl-5-oxo-1-(2-trifluoromethyl-phenyl)-1,5-dihydro-[1,2,4]triazol-4-ylmethyl]-biphenyl-2-sulfonic acid cyclohexanecarbonyl-amide::CHEMBL94905
SMILES CCCCc1nn(-c2ccccc2C(F)(F)F)c(=O)n1Cc1ccc(cc1)-c1ccccc1S(=O)(=O)NC(=O)C1CCCCC1
InChI Key InChIKey=KLYVARHCIOHMIV-UHFFFAOYSA-N
Data  2 IC50
  Tab Delimited (TSV)   2D SDfile   Computed 3D by Vconf -m prep SDfile
Find this compound or compounds like it in BindingDB:
Activity Spreadsheet -- Enzyme Inhibition Constant Data from BindingDB
Found 2 hits for monomerid = 50039880
TargetType-2 angiotensin II receptor(RAT)
Merck Research Laboratories
Curated by ChEMBL
LigandPNGBDBM50039880(4'-[3-Butyl-5-oxo-1-(2-trifluoromethyl-phenyl)-1,5...)
Affinity DataIC50:  160nM. Assay description: In vitro inhibitory activity against angiotensin II rat midbrain AT2 receptor using radioligand [125I]-Sar Ile-AII
In DepthDetails ArticlePubMed
TargetType-1 angiotensin II receptor(RABBIT)
Merck Research Laboratories
Curated by ChEMBL
LigandPNGBDBM50039880(4'-[3-Butyl-5-oxo-1-(2-trifluoromethyl-phenyl)-1,5...)
Affinity DataIC50:  0.150nM. Assay description: In vitro inhibitory activity against angiotensin II rabbit aorta AT1 receptor using radioligand [125I]-Sar Ile-AII
In DepthDetails ArticlePubMed