BDBM50040000 CHEMBL327974::{(R)-1-[(S)-1-((S)-1-Ethylcarbamoyl-butylcarbamoyl)-3-methyl-butylcarbamoyl]-2-phenyl-ethyl}-carbamic acid tert-butyl ester
SMILES CCC[C@H](NC(=O)[C@H](CC(C)C)NC(=O)[C@@H](Cc1ccccc1)NC(=O)OC(C)(C)C)C(=O)NCC
InChI Key InChIKey=TZAPOJSPYZNJDT-FDFHNCONSA-N
Data  1 KI
  Tab Delimited (TSV)   2D SDfile   Computed 3D by Vconf -m prep SDfile
Find this compound or compounds like it in BindingDB:
Activity Spreadsheet -- Enzyme Inhibition Constant Data from BindingDB
Found 1 hit for monomerid = 50040000
TargetCalpain-1 catalytic subunit(Homo sapiens (Human))
Alkermes
Curated by ChEMBL
LigandPNGBDBM50040000(CHEMBL327974 | {(R)-1-[(S)-1-((S)-1-Ethylcarbamoyl...)
Affinity DataKi:  93nM. Assay description: In vitro inhibition of porcine erythrocyte calpain 1.
In DepthDetails ArticlePubMed