BDBM50040001 (S)-2-((S)-2-Amino-3-phenyl-propionylamino)-4-methyl-pentanoic acid ((S)-1-ethylcarbamoyl-butyl)-amide::CHEMBL101954
SMILES CCC[C@H](NC(=O)[C@H](CC(C)C)NC(=O)[C@@H](N)Cc1ccccc1)C(=O)NCC
InChI Key InChIKey=CBUSOBMIUISEJC-FHWLQOOXSA-N
Data  1 KI
  Tab Delimited (TSV)   2D SDfile   Computed 3D by Vconf -m prep SDfile
Find this compound or compounds like it in BindingDB:
Activity Spreadsheet -- Enzyme Inhibition Constant Data from BindingDB
Found 1 hit for monomerid = 50040001
TargetCalpain-1 catalytic subunit(Homo sapiens (Human))
Alkermes
Curated by ChEMBL
LigandPNGBDBM50040001((S)-2-((S)-2-Amino-3-phenyl-propionylamino)-4-meth...)
Affinity DataKi:  116nM. Assay description: In vitro inhibition of porcine erythrocyte calpain 1.
In DepthDetails ArticlePubMed