BDBM50040051 1-(2-Hydroxy-cyclohexyl)-4,6-dipropyl-1,4-dihydro-[1,2,3]triazolo[4,5-d]pyrimidine-5,7-dione::CHEMBL100440
SMILES CCCn1c2nnn(C3CCCCC3O)c2c(=O)n(CCC)c1=O
InChI Key InChIKey=BGADFHJEBWKORI-UHFFFAOYSA-N
Data  2 KI
  Tab Delimited (TSV)   2D SDfile   Computed 3D by Vconf -m prep SDfile
Find this compound or compounds like it in BindingDB:
Activity Spreadsheet -- Enzyme Inhibition Constant Data from BindingDB
Found 2 hits for monomerid = 50040051
TargetAdenosine receptor A1(BOVINE)
Università
Curated by ChEMBL
LigandPNGBDBM50040051(1-(2-Hydroxy-cyclohexyl)-4,6-dipropyl-1,4-dihydro-...)
Affinity DataKi:  1.80E+3nM. Assay description: Affinity to A1 adenosine receptor was measured by the displacement of [3H]-PIA in bovine brain cortical membrane
In DepthDetails ArticlePubMed
TargetAdenosine receptor A2a(Homo sapiens (Human))
Università
Curated by ChEMBL
LigandPNGBDBM50040051(1-(2-Hydroxy-cyclohexyl)-4,6-dipropyl-1,4-dihydro-...)
Affinity DataKi:  1.35E+4nM. Assay description: Affinity to A2 adenosine receptor was measured by the displacement of [3H]-CGS- 21680 in bovine brain striatal membrane
In DepthDetails ArticlePubMed