BDBM50040073 4-Chloro-N-{2-[2-hydroxy-3-(3-oxo-3,4-dihydro-2H-benzo[1,4]thiazin-8-yloxy)-propylamino]-ethyl}-3-sulfamoyl-benzamide::CHEMBL38532
SMILES NS(=O)(=O)c1cc(ccc1Cl)C(=O)NCCNCC(O)COc1cccc2NC(=O)CSc12
InChI Key InChIKey=UGQSGQACSVHJAZ-UHFFFAOYSA-N
Data  1 KI
  Tab Delimited (TSV)   2D SDfile   Computed 3D by Vconf -m prep SDfile
Find this compound or compounds like it in BindingDB:
Activity Spreadsheet -- Enzyme Inhibition Constant Data from BindingDB
Found 1 hit for monomerid = 50040073
TargetBeta-1 adrenergic receptor(Homo sapiens (Human))
Università
Curated by ChEMBL
LigandPNGBDBM50040073(4-Chloro-N-{2-[2-hydroxy-3-(3-oxo-3,4-dihydro-2H-b...)
Affinity DataKi:  7.40nM. Assay description: Inhibition of [3H]-Dihydroalprenolol binding to beta 1 adrenoceptor from turkey erythrocyte membranes.
In DepthDetails ArticlePubMed