BDBM50040398 (3-Phenyl-propyl)-phosphonic acid mono-[(R)-1-((1S,2S,4R)-4-butylcarbamoyl-1-cyclohexylmethyl-2-hydroxy-pentylcarbamoyl)-ethyl] ester::CHEMBL143837
SMILES CCCCNC(=O)[C@H](C)C[C@H](O)[C@H](CC1CCCCC1)NC(=O)[C@@H](C)OP(O)(=O)CCCc1ccccc1
InChI Key InChIKey=MPIMSIROJYQCNO-YWUUFRFPSA-N
Data  3 IC50
  Tab Delimited (TSV)   2D SDfile   Computed 3D by Vconf -m prep SDfile
Find this compound or compounds like it in BindingDB:
Activity Spreadsheet -- Enzyme Inhibition Constant Data from BindingDB
Found 3 hits for monomerid = 50040398
TargetCathepsin D(Bos taurus)
E. Merck Darmstadt
Curated by ChEMBL
LigandPNGBDBM50040398((3-Phenyl-propyl)-phosphonic acid mono-[(R)-1-((1S...)
Affinity DataIC50: >1.00E+4nM. Assay description: In vitro inhibition of bovine cathepsin D.
In DepthDetails ArticlePubMed
TargetPepsin A(Porcine)
E. Merck Darmstadt
Curated by ChEMBL
LigandPNGBDBM50040398((3-Phenyl-propyl)-phosphonic acid mono-[(R)-1-((1S...)
Affinity DataIC50: >1.00E+4nM. Assay description: In vitro inhibition of porcine pepsin.
In DepthDetails ArticlePubMed
TargetRenin(Homo sapiens (Human))
E. Merck Darmstadt
Curated by ChEMBL
LigandPNGBDBM50040398((3-Phenyl-propyl)-phosphonic acid mono-[(R)-1-((1S...)
Affinity DataIC50:  16nM. Assay description: In vitro inhibition of human renin.
In DepthDetails ArticlePubMed