BDBM50040423 7-(3-(4-methoxytetrahydro-2H-pyran-4-yl)benzyloxy)-4-phenylnaphtho[2,3-c]furan-1(3H)-one::7-[3-(4-Methoxy-tetrahydro-pyran-4-yl)-benzyloxy]-4-phenyl-3H-naphtho[2,3-c]furan-1-one::CHEMBL129292
SMILES COC1(CCOCC1)c1cccc(COc2ccc3c(c4COC(=O)c4cc3c2)-c2ccccc2)c1
InChI Key InChIKey=VYQIKMSBOJBSHY-UHFFFAOYSA-N
Data  2 IC50
  Tab Delimited (TSV)   2D SDfile   Computed 3D by Vconf -m prep SDfile
Find this compound or compounds like it in BindingDB:
Activity Spreadsheet -- Enzyme Inhibition Constant Data from BindingDB
Found 2 hits for monomerid = 50040423
TargetPolyunsaturated fatty acid 5-lipoxygenase(Homo sapiens (Human))
Merck Frosst Centre For Therapeutic Research
Curated by ChEMBL
LigandPNGBDBM50040423(7-(3-(4-methoxytetrahydro-2H-pyran-4-yl)benzyloxy)...)
Affinity DataIC50:  14nM. Assay description: Potency to inhibit oxidation of arachidonic acid by recombinant human 5-lipoxygenase
In DepthDetails ArticlePubMed
TargetPolyunsaturated fatty acid 5-lipoxygenase(Homo sapiens (Human))
Merck Frosst Centre For Therapeutic Research
Curated by ChEMBL
LigandPNGBDBM50040423(7-(3-(4-methoxytetrahydro-2H-pyran-4-yl)benzyloxy)...)
Affinity DataIC50:  14nM. Assay description: In vitro potency against human 5-Lipoxygenase
In DepthDetails ArticlePubMed