BDBM50040464 (S)-3-((S)-(E)-Dec-3-enoylamino)-4-(naphthalen-2-ylsulfanyl)-butyric acid::CHEMBL152031
SMILES CCCCCC\C=C\CC(=O)N[C@H](CSc1ccc2ccccc2c1)CC(O)=O
InChI Key InChIKey=UCVBUYTVQOAQJO-CQQBXOTJSA-N
Data  2 IC50
  Tab Delimited (TSV)   2D SDfile   Computed 3D by Vconf -m prep SDfile
Find this compound or compounds like it in BindingDB:
Activity Spreadsheet -- Enzyme Inhibition Constant Data from BindingDB
Found 2 hits for monomerid = 50040464
TargetGroup 10 secretory phospholipase A2(Homo sapiens (Human))
Fisons
Curated by ChEMBL
LigandPNGBDBM50040464((S)-3-((S)-(E)-Dec-3-enoylamino)-4-(naphthalen-2-y...)
Affinity DataIC50:  790nM. Assay description: In vitro activity against porcine pancreatic phospholipase-A2 (PLA2) and micellar substrate with deoxycholate (DOC)
In DepthDetails ArticlePubMed
LigandPNGBDBM50040464((S)-3-((S)-(E)-Dec-3-enoylamino)-4-(naphthalen-2-y...)
Affinity DataIC50:  23nM. Assay description: In vitro activity against porcine pancreatic phospholipase-A2 (PLA2) and monomerically dispersed substrate
In DepthDetails ArticlePubMed