BDBM50040465 (S)-3-((S)-(E)-Dec-3-enoylamino)-4-phenylsulfanyl-butyric acid::CHEMBL357750
SMILES CCCCCC\C=C\CC(=O)N[C@H](CSc1ccccc1)CC(O)=O
InChI Key InChIKey=CBZCAUILHUNILM-ZBZNSMLMSA-N
Data  2 IC50
  Tab Delimited (TSV)   2D SDfile   Computed 3D by Vconf -m prep SDfile
Find this compound or compounds like it in BindingDB:
Activity Spreadsheet -- Enzyme Inhibition Constant Data from BindingDB
Found 2 hits for monomerid = 50040465
LigandPNGBDBM50040465((S)-3-((S)-(E)-Dec-3-enoylamino)-4-phenylsulfanyl-...)
Affinity DataIC50:  95nM. Assay description: In vitro activity against porcine pancreatic phospholipase-A2 (PLA2) and monomerically dispersed substrate
In DepthDetails ArticlePubMed
TargetGroup 10 secretory phospholipase A2(Homo sapiens (Human))
Fisons
Curated by ChEMBL
LigandPNGBDBM50040465((S)-3-((S)-(E)-Dec-3-enoylamino)-4-phenylsulfanyl-...)
Affinity DataIC50:  2.20E+3nM. Assay description: In vitro activity against porcine pancreatic phospholipase-A2 (PLA2) and micellar substrate with deoxycholate (DOC)
In DepthDetails ArticlePubMed