BDBM50040734 CHEMBL3353214
SMILES CN(C)C(=O)Cc1ccc2nc(NC(=O)c3cccc(Cn4nc(ccc4=O)-c4cccnc4)c3)[nH]c2c1
InChI Key InChIKey=GDTWJJTWBAUDNO-UHFFFAOYSA-N
Data  2 IC50
  Tab Delimited (TSV)   2D SDfile   Computed 3D by Vconf -m prep SDfile
Find this compound or compounds like it in BindingDB:
Activity Spreadsheet -- Enzyme Inhibition Constant Data from BindingDB
Found 2 hits for monomerid = 50040734
TargetInterleukin-1 receptor-associated kinase 1(Homo sapiens (Human))
Nimbus Discovery
Curated by ChEMBL
LigandPNGBDBM50040734(CHEMBL3353214)
Affinity DataIC50: <100nM. Assay description: Inhibition of IRAK1 (unknown origin) by radiochemical assay
In DepthDetails ArticlePubMed
TargetInterleukin-1 receptor-associated kinase 4(Homo sapiens (Human))
Nimbus Discovery
Curated by ChEMBL
LigandPNGBDBM50040734(CHEMBL3353214)
Affinity DataIC50: <100nM. Assay description: Inhibition of IRAK4 (unknown origin) by radiochemical assay
In DepthDetails ArticlePubMed