BDBM50040746 CHEMBL262519::[(4S,7R,13R,16S)-16-Acetylamino-4-carbamoyl-14-ethyl-13-(3-guanidino-propyl)-3,3-dimethyl-6,9,12,15-tetraoxo-1,2-dithia-5,8,11,14-tetraaza-cycloheptadec-7-yl]-acetic acid
SMILES CCN1[C@H](CCCNC(N)=N)C(=O)NCC(=O)N[C@H](CC(O)=O)C(=O)N[C@@H](C(N)=O)C(C)(C)SSC[C@@H](NC(C)=O)C1=O
InChI Key InChIKey=LJTLOQLGXVVLML-ADAWSYLGSA-N
Data  1 KI
  Tab Delimited (TSV)   2D SDfile   Computed 3D by Vconf -m prep SDfile
Find this compound or compounds like it in BindingDB:
Activity Spreadsheet -- Enzyme Inhibition Constant Data from BindingDB
Found 1 hit for monomerid = 50040746
TargetIntegrin alpha-IIb/beta-3(Homo sapiens (Human))
Smithkline Beecham Pharmaceuticals Research And Development
Curated by ChEMBL
LigandPNGBDBM50040746(CHEMBL262519 | [(4S,7R,13R,16S)-16-Acetylamino-4-c...)
Affinity DataKi:  65nM. Assay description: Tested for inhibition of fibrinogen binding to purified GPIIb/IIIa isolated from human platelets and reconstituted in liposomes
In DepthDetails ArticlePubMed