BDBM50040766 CHEMBL353203::[(4S,7R,13R,16S)-16-Acetylamino-4-carbamoyl-13-(3-guanidino-propyl)-3,3,11-trimethyl-6,9,12,15-tetraoxo-1,2-dithia-5,8,11,14-tetraaza-cycloheptadec-7-yl]-acetic acid
SMILES CN1CC(=O)N[C@H](CC(O)=O)C(=O)N[C@@H](C(N)=O)C(C)(C)SSC[C@@H](NC(C)=O)C(=O)N[C@H](CCCNC(N)=N)C1=O
InChI Key InChIKey=PNNKIIFXOAKISH-WBOJAVRRSA-N
Data  1 KI
  Tab Delimited (TSV)   2D SDfile   Computed 3D by Vconf -m prep SDfile
Find this compound or compounds like it in BindingDB:
Activity Spreadsheet -- Enzyme Inhibition Constant Data from BindingDB
Found 1 hit for monomerid = 50040766
TargetIntegrin alpha-IIb/beta-3(Homo sapiens (Human))
Smithkline Beecham Pharmaceuticals Research And Development
Curated by ChEMBL
LigandPNGBDBM50040766(CHEMBL353203 | [(4S,7R,13R,16S)-16-Acetylamino-4-c...)
Affinity DataKi:  1.25E+3nM. Assay description: Tested for inhibition of fibrinogen binding to purified GPIIb/IIIa isolated from human platelets and reconstituted in liposomes
In DepthDetails ArticlePubMed