BDBM50040768 CHEMBL351514::[(4S,7R,13R,16R)-16-Acetylamino-4-carbamoyl-13-(3-guanidino-propyl)-3,3-dimethyl-6,9,12,15-tetraoxo-1,2-dithia-5,8,11,14-tetraaza-cycloheptadec-7-yl]-acetic acid
SMILES CC(=O)N[C@H]1CSSC(C)(C)[C@@H](NC(=O)[C@@H](CC(O)=O)NC(=O)CNC(=O)[C@@H](CCCNC(N)=N)NC1=O)C(N)=O
InChI Key InChIKey=FWEONMXPHGWDHS-FOCJUVANSA-N
Data  1 KI
  Tab Delimited (TSV)   2D SDfile   Computed 3D by Vconf -m prep SDfile
Find this compound or compounds like it in BindingDB:
Activity Spreadsheet -- Enzyme Inhibition Constant Data from BindingDB
Found 1 hit for monomerid = 50040768
TargetIntegrin alpha-IIb/beta-3(Homo sapiens (Human))
Smithkline Beecham Pharmaceuticals Research And Development
Curated by ChEMBL
LigandPNGBDBM50040768(CHEMBL351514 | [(4S,7R,13R,16R)-16-Acetylamino-4-c...)
Affinity DataKi:  2.65E+3nM. Assay description: Tested for inhibition of fibrinogen binding to purified GPIIb/IIIa isolated from human platelets and reconstituted in liposomes
In DepthDetails ArticlePubMed