BDBM50040793 CHEMBL3352825::US9546153, ex. 79
SMILES CC(C)(O)[C@H](F)CNC(=O)c1cnc(Nc2ccc3cnccc3n2)cc1NC1CC1
InChI Key InChIKey=PXAWSYHMHMFXBD-GOSISDBHSA-N
Data  2 IC50
  Tab Delimited (TSV)   2D SDfile   Computed 3D by Vconf -m prep SDfile
Find this compound or compounds like it in BindingDB:
Activity Spreadsheet -- Enzyme Inhibition Constant Data from BindingDB
Found 2 hits for monomerid = 50040793
TargetInterleukin-1 receptor-associated kinase 4(Homo sapiens (Human))
Bristol-Myers Squibb
US Patent
LigandPNGBDBM50040793(CHEMBL3352825 | US9546153, ex. 79)
Affinity DataIC50:  5.60nMpH: 7.2 T: 2°C. Assay description: The assays were performed in U-bottom 384-well plates. The final assay volume was 30 μL prepared from 15 μL additions of enzyme and substra...
In DepthDetails US Patent
TargetInterleukin-1 receptor-associated kinase 4(Homo sapiens (Human))
Bristol-Myers Squibb
US Patent
LigandPNGBDBM50040793(CHEMBL3352825 | US9546153, ex. 79)
Affinity DataIC50:  5.60nM. Assay description: Inhibition of IRAK4 (unknown origin) using fluoresceinated peptide and ATP after 60 mins by by Caliper assay
In DepthDetails ArticlePubMed