BDBM50041207 CHEMBL3355973
SMILES CCOC(=O)N1Cc2nc(nn2-c2cc(C)ccc12)-c1ccccc1
InChI Key InChIKey=JNNCTJXFLXJKKM-UHFFFAOYSA-N
Data  2 KI
  Tab Delimited (TSV)   2D SDfile   Computed 3D by Vconf -m prep SDfile
Find this compound or compounds like it in BindingDB:
Activity Spreadsheet -- Enzyme Inhibition Constant Data from BindingDB
Found 2 hits for monomerid = 50041207
TargetAdenosine receptor A3(Homo sapiens (Human))
Universit£
Curated by ChEMBL
LigandPNGBDBM50041207(CHEMBL3355973)
Affinity DataKi:  13nM. Assay description: Displacement of [125I]AB-MECA from human adenosine A3 receptor expressed in CHO cells
In DepthDetails ArticlePubMed
TargetAdenosine receptor A1(Homo sapiens (Human))
Universit£
Curated by ChEMBL
LigandPNGBDBM50041207(CHEMBL3355973)
Affinity DataKi:  556nM. Assay description: Displacement of [3H]DPCPX from human adenosine A1 receptor expressed in CHO cells
In DepthDetails ArticlePubMed