BDBM50041263 Benzyl-(5-cyclohexyl-pentyl)-amine::CHEMBL416730
SMILES C(CCNCc1ccccc1)CCC1CCCCC1
InChI Key InChIKey=WFYQBAUTQQAKDH-UHFFFAOYSA-N
Data  1 KI
  Tab Delimited (TSV)   2D SDfile   Computed 3D by Vconf -m prep SDfile
Find this compound or compounds like it in BindingDB:
Activity Spreadsheet -- Enzyme Inhibition Constant Data from BindingDB
Found 1 hit for monomerid = 50041263
TargetSigma non-opioid intracellular receptor 1(Homo sapiens (Human))
Virginia Commonwealth University
Curated by ChEMBL
LigandPNGBDBM50041263(Benzyl-(5-cyclohexyl-pentyl)-amine | CHEMBL416730)
Affinity DataKi:  0.810nM. Assay description: Binding affinity against sigma-1 receptor of guinea pig brain membranes using [3H]-pentazocine as radioligand
In DepthDetails ArticlePubMed