BDBM50041268 Benzyl-methyl-(5-phenyl-pentyl)-amine::CHEMBL19314
SMILES CN(CCCCCc1ccccc1)Cc1ccccc1
InChI Key InChIKey=IADZHQIILDQUCH-UHFFFAOYSA-N
Data  1 KI
  Tab Delimited (TSV)   2D SDfile   Computed 3D by Vconf -m prep SDfile
Find this compound or compounds like it in BindingDB:
Activity Spreadsheet -- Enzyme Inhibition Constant Data from BindingDB
Found 1 hit for monomerid = 50041268
TargetSigma non-opioid intracellular receptor 1(Homo sapiens (Human))
Virginia Commonwealth University
Curated by ChEMBL
LigandPNGBDBM50041268(Benzyl-methyl-(5-phenyl-pentyl)-amine | CHEMBL1931...)
Affinity DataKi:  0.190nM. Assay description: Binding affinity against sigma-1 receptor of guinea pig brain membranes using [3H]-pentazocine as radioligand
In DepthDetails ArticlePubMed