BDBM50041308 3-(4-Iodo-phenyl)-8-methyl-8-aza-bicyclo[3.2.1]octane-2-carboxylic acid ethyl ester::CHEMBL23714
SMILES CCOC(=O)C1C2CCC(CC1c1ccc(I)cc1)N2C
InChI Key InChIKey=VOUOGJPPHPSUFT-UHFFFAOYSA-N
Data  1 Kd
  Tab Delimited (TSV)   2D SDfile   Computed 3D by Vconf -m prep SDfile
Find this compound or compounds like it in BindingDB:
Activity Spreadsheet -- Enzyme Inhibition Constant Data from BindingDB
Found 1 hit for monomerid = 50041308
TargetSodium-dependent dopamine transporter(Rattus norvegicus (rat))
Wake Forest University
Curated by ChEMBL
LigandPNGBDBM50041308(3-(4-Iodo-phenyl)-8-methyl-8-aza-bicyclo[3.2.1]oct...)
Affinity DataKd:  1nM. Assay description: The potency of the [125I]RTI-55 for Dopamine transporter site
In DepthDetails ArticlePubMed