BDBM50041464 3-(3-Benzyl-phenyl)-7-chloro-4-hydroxy-1H-quinolin-2-one::CHEMBL32240
SMILES Oc1c(-c2cccc(Cc3ccccc3)c2)c(=O)[nH]c2cc(Cl)ccc12
InChI Key InChIKey=TXJNBHVQPGOFGA-UHFFFAOYSA-N
Data  1 IC50
  Tab Delimited (TSV)   2D SDfile   Computed 3D by Vconf -m prep SDfile
Find this compound or compounds like it in BindingDB:
Activity Spreadsheet -- Enzyme Inhibition Constant Data from BindingDB
Found 1 hit for monomerid = 50041464
TargetGlutamate receptor ionotropic, NMDA 1(RAT)
Merck Sharp And Dohme Research Laboratories
Curated by ChEMBL
LigandPNGBDBM50041464(3-(3-Benzyl-phenyl)-7-chloro-4-hydroxy-1H-quinolin...)
Affinity DataIC50:  4.10nM. Assay description: Inhibition of the binding of [3H]-L-689,560 ([3H]-4) to the strychnine-insensitive glycine site on rat brain membranes
In DepthDetails ArticlePubMed