BDBM50041569 17-(cyclopropylmethyl)-17'-aminoethyl-6,6',7,7'-tetradehydro-4,5:4',5'-diepoxy-6,6'-imino-7,7'-bimorphinan-3,3',14,14'-tetrol::CHEMBL285052
SMILES NCC(=O)NCC(=O)N1CC[C@@]23[C@H]4Oc5c2c(C[C@@H]1[C@]3(O)Cc1c2C[C@@]3(O)[C@H]6Cc7ccc(O)c8O[C@@H](c2[nH]c41)[C@]3(CCN6CC1CC1)c78)ccc5O
InChI Key InChIKey=QSSOIVBGIOETKQ-FUCLXHLGSA-N
Data  3 KI
  Tab Delimited (TSV)   2D SDfile   Computed 3D by Vconf -m prep SDfile
Find this compound or compounds like it in BindingDB:
Activity Spreadsheet -- Enzyme Inhibition Constant Data from BindingDB
Found 3 hits for monomerid = 50041569
TargetKappa-type opioid receptor(Cavia porcellus (domestic guinea pig))
University Of Minnesota
Curated by ChEMBL
LigandPNGBDBM50041569(17-(cyclopropylmethyl)-17'-aminoethyl-6,6',7,7'-te...)
Affinity DataKi:  21nM. Assay description: The binding affinity on kappa-opioid receptor using [3H]- U-69,593 as radioligand
In DepthDetails ArticlePubMed
TargetMu-type opioid receptor(GUINEA PIG)
University Of Minnesota
Curated by ChEMBL
LigandPNGBDBM50041569(17-(cyclopropylmethyl)-17'-aminoethyl-6,6',7,7'-te...)
Affinity DataKi:  66nM. Assay description: The binding affinity against mu-opioid receptor using [3H]- DAMGO as radioligand
In DepthDetails ArticlePubMed
TargetDelta-type opioid receptor(Homo sapiens (Human))
University Of Minnesota
Curated by ChEMBL
LigandPNGBDBM50041569(17-(cyclopropylmethyl)-17'-aminoethyl-6,6',7,7'-te...)
Affinity DataKi: >1.00E+3nM. Assay description: The binding affinity on delta-opioid receptor using [3H]- DPDPE as radioligand
In DepthDetails ArticlePubMed