BDBM50041663 2-Amino-N-(7-benzyl-4-dihydroxymethyl-10-hydroxymethyl-3,3,14,14-tetramethyl-6,9,12-trioxo-1,2-dithia-5,8,11-triaza-cyclotetradec-13-yl)-3-(4-hydroxy-phenyl)-propionamide::CHEMBL2372409
SMILES CC1(C)SSC(C)(C)[C@H](NC(=O)[C@@H](N)Cc2ccc(O)cc2)C(=O)N[C@@H](CO)C(=O)N[C@@H](Cc2ccccc2)C(=O)N[C@@H]1C(O)O
InChI Key InChIKey=KWGMXBJZDBBUHD-ZROJVYTPSA-N
Data  4 IC50
  Tab Delimited (TSV)   2D SDfile   Computed 3D by Vconf -m prep SDfile
Find this compound or compounds like it in BindingDB:
Activity Spreadsheet -- Enzyme Inhibition Constant Data from BindingDB
Found 4 hits for monomerid = 50041663
TargetMu-type opioid receptor(GUINEA PIG)
University Of Arizona
Curated by ChEMBL
LigandPNGBDBM50041663(2-Amino-N-(7-benzyl-4-dihydroxymethyl-10-hydroxyme...)
Affinity DataIC50:  3.90E+4nM. Assay description: Inhibitory activity of the electrically induced guinea pig ileum longitudal muscle-myenteric plexus
In DepthDetails ArticlePubMed
TargetMu-type opioid receptor(Rattus norvegicus (rat))
University Of Arizona
Curated by ChEMBL
LigandPNGBDBM50041663(2-Amino-N-(7-benzyl-4-dihydroxymethyl-10-hydroxyme...)
Affinity DataIC50: >2.25E+4nM. Assay description: Evaluation for the binding affinity by competitive inhibition of [3H]- CTOP binding
In DepthDetails ArticlePubMed
TargetDelta-type opioid receptor(MOUSE)
University Of Arizona
Curated by ChEMBL
LigandPNGBDBM50041663(2-Amino-N-(7-benzyl-4-dihydroxymethyl-10-hydroxyme...)
Affinity DataIC50:  250nM. Assay description: Inhibitory activity of the electrically induced smooth muscle contraction of mouse vas deferens
In DepthDetails ArticlePubMed
TargetDelta-type opioid receptor(Rattus norvegicus (rat))
University Of Arizona
Curated by ChEMBL
LigandPNGBDBM50041663(2-Amino-N-(7-benzyl-4-dihydroxymethyl-10-hydroxyme...)
Affinity DataIC50:  42nM. Assay description: Evaluation for the binding affinity by competitive inhibition of [3H]- p-chloro DPDPE binding
In DepthDetails ArticlePubMed