BDBM50042003 CHEMBL3360115
SMILES Cn1c(nc(C(=O)NCc2ccc(F)cc2)c(O)c1=O)C1(C)CCCS1
InChI Key InChIKey=SJTGUAIXCKNKQQ-UHFFFAOYSA-N
Data  1 IC50
  Tab Delimited (TSV)   2D SDfile   Computed 3D by Vconf -m prep SDfile
Find this compound or compounds like it in BindingDB:
Activity Spreadsheet -- Enzyme Inhibition Constant Data from BindingDB
Found 1 hit for monomerid = 50042003
TargetIntegrase(Human immunodeficiency virus 1)
Bristol-Myers Squibb Research And Development
Curated by ChEMBL
LigandPNGBDBM50042003(CHEMBL3360115)
Affinity DataIC50:  5nM. Assay description: Inhibition of HIV-1 integrase strand transfer activity
In DepthDetails ArticlePubMed