BDBM50042022 CHEMBL3360128
SMILES COCCN1CCN(C1=O)c1cc(F)ccc1CNC(=O)c1nc(C2CCOC2)n(C)c(=O)c1O
InChI Key InChIKey=MWOWPHYFPJLZBJ-UHFFFAOYSA-N
Data  1 IC50
  Tab Delimited (TSV)   2D SDfile   Computed 3D by Vconf -m prep SDfile
Find this compound or compounds like it in BindingDB:
Activity Spreadsheet -- Enzyme Inhibition Constant Data from BindingDB
Found 1 hit for monomerid = 50042022
TargetIntegrase(Human immunodeficiency virus 1)
Bristol-Myers Squibb Research And Development
Curated by ChEMBL
LigandPNGBDBM50042022(CHEMBL3360128)
Affinity DataIC50:  3nM. Assay description: Inhibition of HIV-1 integrase strand transfer activity
In DepthDetails ArticlePubMed