BDBM50042159 3-[6-(2-Carboxy-vinyl)-5-dodecyloxy-pyridin-2-ylmethanesulfinyl]-benzoic acid::CHEMBL111908
SMILES CCCCCCCCCCCCOc1ccc(CS(=O)c2cccc(c2)C(O)=O)nc1C=CC(O)=O
InChI Key InChIKey=ORKPEVLNPAHWMH-UHFFFAOYSA-N
Data  1 KI
  Tab Delimited (TSV)   2D SDfile   Computed 3D by Vconf -m prep SDfile
Find this compound or compounds like it in BindingDB:
Activity Spreadsheet -- Enzyme Inhibition Constant Data from BindingDB
Found 1 hit for monomerid = 50042159
TargetLeukotriene B4 receptor 1(Homo sapiens (Human))
Smithkline Beecham Pharmaceuticals
Curated by ChEMBL
LigandPNGBDBM50042159(3-[6-(2-Carboxy-vinyl)-5-dodecyloxy-pyridin-2-ylme...)
Affinity DataKi:  129nM. Assay description: Binding affinity of [3H]-LTB4 to receptors on intact human polymorphonuclear leukocytes
In DepthDetails ArticlePubMed