BDBM50042247 4'-(2-Butyl-4-oxo-1,3-diaza-spiro[4.4]non-1-en-3-ylmethyl)-biphenyl-2-carboxylic acid methyl ester::4'-(2-butyl-4-oxo-1,3-diazaspiro[4,4]non-1-en-3-ylmethyl)-biphe-nyl-2-carboxylic acid methyl ester::CHEMBL325502
SMILES CCCCC1=NC2(CCCC2)C(=O)N1Cc1ccc(cc1)-c1ccccc1C(=O)OC
InChI Key InChIKey=XYYYFJUWDFFJAL-UHFFFAOYSA-N
Data  4 IC50
  Tab Delimited (TSV)   2D SDfile   Computed 3D by Vconf -m prep SDfile
Find this compound or compounds like it in BindingDB:
Activity Spreadsheet -- Enzyme Inhibition Constant Data from BindingDB
Found 4 hits for monomerid = 50042247
TargetType-1 angiotensin II receptor B(RAT)
Sanofi Recherche
Curated by ChEMBL
LigandPNGBDBM50042247(4'-(2-Butyl-4-oxo-1,3-diaza-spiro[4.4]non-1-en-3-y...)
Affinity DataIC50:  1.80E+3nM. Assay description: Binding affinity for Angiotensin II receptor, type 1 measured by ability to displace [125I]- A II from its specific binding site in rat liver membran...
In DepthDetails ArticlePubMed
TargetAcetylcholinesterase(Electrophorus electricus (Electric eel))
University Of Mysore
Curated by ChEMBL
LigandPNGBDBM50042247(4'-(2-Butyl-4-oxo-1,3-diaza-spiro[4.4]non-1-en-3-y...)
Affinity DataIC50:  236nM. Assay description: Inhibition of electric eel AChE by Ellman colorimetric assay
In DepthDetails ArticlePubMed
TargetAcetylcholinesterase(Homo sapiens (Human))
University Of Mysore
Curated by ChEMBL
LigandPNGBDBM50042247(4'-(2-Butyl-4-oxo-1,3-diaza-spiro[4.4]non-1-en-3-y...)
Affinity DataIC50:  241nM. Assay description: Inhibition of human serum AChE by Ellman colorimetric assay
In DepthDetails ArticlePubMed
TargetAcetylcholinesterase(Rattus norvegicus (rat))
University Of Mysore
Curated by ChEMBL
LigandPNGBDBM50042247(4'-(2-Butyl-4-oxo-1,3-diaza-spiro[4.4]non-1-en-3-y...)
Affinity DataIC50:  243nM. Assay description: Inhibition of Wistar rat brain AChE by Ellman colorimetric assay
In DepthDetails ArticlePubMed