BDBM50042266 4'-(2-Butyl-4-oxo-1,3-diaza-spiro[4.6]undec-1-en-3-ylmethyl)-biphenyl-2-carboxylic acid::CHEMBL325201
SMILES CCCCC1=NC2(CCCCCC2)C(=O)N1Cc1ccc(cc1)-c1ccccc1C(O)=O
InChI Key InChIKey=BCYZATPCMXUCDR-UHFFFAOYSA-N
Data  1 IC50
  Tab Delimited (TSV)   2D SDfile   Computed 3D by Vconf -m prep SDfile
Find this compound or compounds like it in BindingDB:
Activity Spreadsheet -- Enzyme Inhibition Constant Data from BindingDB
Found 1 hit for monomerid = 50042266
TargetType-1 angiotensin II receptor B(RAT)
Sanofi Recherche
Curated by ChEMBL
LigandPNGBDBM50042266(4'-(2-Butyl-4-oxo-1,3-diaza-spiro[4.6]undec-1-en-3...)
Affinity DataIC50:  8.70nM. Assay description: Binding affinity for Angiotensin II receptor, type 1 measured by ability to displace [125I]- A II from its specific binding site in rat liver membran...
In DepthDetails ArticlePubMed