BDBM50042352 5-Methyl-6-[(3,4,5-trichloro-phenylamino)-methyl]-pyrido[2,3-d]pyrimidine-2,4-diamine::CHEMBL420224
SMILES Cc1c(CNc2cc(Cl)c(Cl)c(Cl)c2)cnc2nc(N)nc(N)c12
InChI Key InChIKey=CWTSTOMTDDHBJU-UHFFFAOYSA-N
Data  9 IC50
  Tab Delimited (TSV)   2D SDfile   Computed 3D by Vconf -m prep SDfile
Find this compound or compounds like it in BindingDB:
Activity Spreadsheet -- Enzyme Inhibition Constant Data from BindingDB
Found 9 hits for monomerid = 50042352
TargetDihydrofolate reductase(Rattus norvegicus (rat))
Duquesne University
Curated by ChEMBL
LigandPNGBDBM50042352(5-Methyl-6-[(3,4,5-trichloro-phenylamino)-methyl]-...)
Affinity DataIC50:  33nM. Assay description: Inhibition of rat liver dihydrofolate reductase
In DepthDetails ArticlePubMed
TargetBifunctional dihydrofolate reductase-thymidylate synthase(Toxoplasma gondii)
Duquesne University
Curated by ChEMBL
LigandPNGBDBM50042352(5-Methyl-6-[(3,4,5-trichloro-phenylamino)-methyl]-...)
Affinity DataIC50:  12nM. Assay description: Inhibition of Toxoplasma gondii dihydrofolate reductase
In DepthDetails ArticlePubMed
TargetDihydrofolate reductase(Pneumocystis carinii)
Duquesne University
Curated by ChEMBL
LigandPNGBDBM50042352(5-Methyl-6-[(3,4,5-trichloro-phenylamino)-methyl]-...)
Affinity DataIC50:  63nM. Assay description: Inhibition of Pneumocystis carinii dihydrofolate reductase
In DepthDetails ArticlePubMed
TargetDihydrofolate reductase(Pneumocystis carinii)
Duquesne University
Curated by ChEMBL
LigandPNGBDBM50042352(5-Methyl-6-[(3,4,5-trichloro-phenylamino)-methyl]-...)
Affinity DataIC50:  63nM. Assay description: Inhibition of dihydrofolate reductase (DHFR) from Pneumocystis carinii(pc)
In DepthDetails ArticlePubMed
TargetDihydrofolate reductase(Rattus norvegicus (rat))
Duquesne University
Curated by ChEMBL
LigandPNGBDBM50042352(5-Methyl-6-[(3,4,5-trichloro-phenylamino)-methyl]-...)
Affinity DataIC50:  33nM. Assay description: Inhibition of rat liver dihydrofolate reductase
In DepthDetails ArticlePubMed
TargetDihydrofolate reductase(Rattus norvegicus (rat))
Duquesne University
Curated by ChEMBL
LigandPNGBDBM50042352(5-Methyl-6-[(3,4,5-trichloro-phenylamino)-methyl]-...)
Affinity DataIC50:  33nM. Assay description: Inhibition of dihydrofolate reductase (DHFR) from rat liver (rl)
In DepthDetails ArticlePubMed
TargetDihydrofolate reductase(Pneumocystis carinii)
Duquesne University
Curated by ChEMBL
LigandPNGBDBM50042352(5-Methyl-6-[(3,4,5-trichloro-phenylamino)-methyl]-...)
Affinity DataIC50:  63nM. Assay description: Inhibition of Pneumocystis carinii dihydrofolate reductase
In DepthDetails ArticlePubMed
TargetBifunctional dihydrofolate reductase-thymidylate synthase(Toxoplasma gondii)
Duquesne University
Curated by ChEMBL
LigandPNGBDBM50042352(5-Methyl-6-[(3,4,5-trichloro-phenylamino)-methyl]-...)
Affinity DataIC50:  12nM. Assay description: Inhibition of Toxoplasma gondii dihydrofolate reductase
In DepthDetails ArticlePubMed
TargetBifunctional dihydrofolate reductase-thymidylate synthase(Toxoplasma gondii)
Duquesne University
Curated by ChEMBL
LigandPNGBDBM50042352(5-Methyl-6-[(3,4,5-trichloro-phenylamino)-methyl]-...)
Affinity DataIC50:  12nM. Assay description: Inhibition of dihydrofolate reductase (DHFR) from Toxoplasma gondii(tg)
In DepthDetails ArticlePubMed