BDBM50042716 8-(2-Methyl-imidazol-1-ylmethyl)-1,2,9,10-tetrahydro-8H-3-oxa-10b-aza-fluoranthen-7-one::CHEMBL123010
SMILES Cc1nccn1CC1CCc2c(C1=O)c1cccc3OCCn2c13
InChI Key InChIKey=FOLKKPQIBNCGSY-UHFFFAOYSA-N
Data  1 KI
  Tab Delimited (TSV)   2D SDfile   Computed 3D by Vconf -m prep SDfile
Find this compound or compounds like it in BindingDB:
Activity Spreadsheet -- Enzyme Inhibition Constant Data from BindingDB
Found 1 hit for monomerid = 50042716
Target5-hydroxytryptamine receptor 3A/3B(Rattus norvegicus)
Solvay Duphar
Curated by ChEMBL
LigandPNGBDBM50042716(8-(2-Methyl-imidazol-1-ylmethyl)-1,2,9,10-tetrahyd...)
Affinity DataKi:  1.30nM. Assay description: Displacement of [3H]GR-65630 binding to 5-hydroxytryptamine 3 receptor in rat brain cortical membranes
In DepthDetails ArticlePubMed