BDBM50042720 3-(5-Methyl-1H-imidazol-4-yl)-1-(4,5,6,7-tetrahydro-azepino[3,2,1-hi]indol-1-yl)-propan-1-one::CHEMBL421424
SMILES Cc1nc[nH]c1CCC(=O)c1cn2CCCCc3cccc1c23
InChI Key InChIKey=ILOKFFOBOKCGBT-UHFFFAOYSA-N
Data  1 KI
  Tab Delimited (TSV)   2D SDfile   Computed 3D by Vconf -m prep SDfile
Find this compound or compounds like it in BindingDB:
Activity Spreadsheet -- Enzyme Inhibition Constant Data from BindingDB
Found 1 hit for monomerid = 50042720
Target5-hydroxytryptamine receptor 3A/3B(Rattus norvegicus)
Solvay Duphar
Curated by ChEMBL
LigandPNGBDBM50042720(3-(5-Methyl-1H-imidazol-4-yl)-1-(4,5,6,7-tetrahydr...)
Affinity DataKi:  0.330nM. Assay description: The binding affinity of the compound was measured on muscarine M1 receptor using [3H]- pirenzepine as radioligand.
In DepthDetails ArticlePubMed