BDBM50042726 4-Amino-5-chloro-N-[1-(4-fluoro-benzyl)-piperidin-4-yl]-2-methoxy-benzamide::CHEMBL125237
SMILES COc1cc(N)c(Cl)cc1C(=O)NC1CCN(Cc2ccc(F)cc2)CC1
InChI Key InChIKey=HKDIGEWWDHALIS-UHFFFAOYSA-N
Data  3 KI
  Tab Delimited (TSV)   2D SDfile   Computed 3D by Vconf -m prep SDfile
Find this compound or compounds like it in BindingDB:
Activity Spreadsheet -- Enzyme Inhibition Constant Data from BindingDB
Found 3 hits for monomerid = 50042726
TargetD(2) dopamine receptor(Rattus norvegicus (rat))
University Of Pennsylvania
Curated by ChEMBL
LigandPNGBDBM50042726(4-Amino-5-chloro-N-[1-(4-fluoro-benzyl)-piperidin-...)
Affinity DataKi:  0.950nM. Assay description: Inhibition of [125I]- NCQ 298 binding to D2 receptor of rat striatal tissue
In DepthDetails ArticlePubMed
TargetSerotonin 2 (5-HT2) receptor(RAT)
University Of Pennsylvania
Curated by ChEMBL
LigandPNGBDBM50042726(4-Amino-5-chloro-N-[1-(4-fluoro-benzyl)-piperidin-...)
Affinity DataKi:  283nM. Assay description: In vitro binding affinity on 5-hydroxytryptamine 2 receptor is inhibition of binding of [125I]- I-LSD to P11 cells
In DepthDetails ArticlePubMed
LigandPNGBDBM50042726(4-Amino-5-chloro-N-[1-(4-fluoro-benzyl)-piperidin-...)
Affinity DataKi:  1.30E+3nM. Assay description: In vitro binding affinity on alpha-2 receptor is inhibition of binding of [3H]- rauwolscine to rat cortex
In DepthDetails ArticlePubMed