BDBM50042755 CHEMBL331446::{6-[5-Methoxycarbonyl-2,6-dimethyl-4-(2-trifluoromethyl-phenyl)-1,4-dihydro-pyridine-3-carbonyloxy]-hexyl}-trimethyl-ammonium
SMILES COC(=O)C1C(C(C(=O)OCCCCCC[N+](C)(C)C)=C(C)N=C1C)c1ccccc1C(F)(F)F
InChI Key InChIKey=QBNKIZCQSBLZBC-UHFFFAOYSA-N
Data  1 KI
  Tab Delimited (TSV)   2D SDfile   Computed 3D by Vconf -m prep SDfile
Find this compound or compounds like it in BindingDB:
Activity Spreadsheet -- Enzyme Inhibition Constant Data from BindingDB
Found 1 hit for monomerid = 50042755
TargetVoltage-dependent L-type calcium channel subunit alpha-1C(RAT)
State University Of New York
Curated by ChEMBL
LigandPNGBDBM50042755(CHEMBL331446 | {6-[5-Methoxycarbonyl-2,6-dimethyl-...)
Affinity DataKi:  234nM. Assay description: Inhibition of [3H](+)-PN200-110 binding to L-type calcium channel 1,4-DHP binding site of rat ventricular myocytes
In DepthDetails ArticlePubMed