BDBM50042816 CHEMBL127856::N-[2-(2-Amino-thiazol-4-yl)-1-(1-cyclohexylmethyl-2-hydroxy-4-hydroxymethyl-5-phenyl-pentylcarbamoyl)-ethyl]-2-(morpholine-4-sulfonylamino)-3-phenyl-propionamide
SMILES Nc1nc(CC(NC(=O)C(Cc2ccccc2)NS(=O)(=O)N2CCOCC2)C(=O)NC(CC2CCCCC2)C(O)CC(CO)Cc2ccccc2)cs1
InChI Key InChIKey=JPAQNCCOLRKBFJ-UHFFFAOYSA-N
Data  1 IC50
  Tab Delimited (TSV)   2D SDfile   Computed 3D by Vconf -m prep SDfile
Find this compound or compounds like it in BindingDB:
Activity Spreadsheet -- Enzyme Inhibition Constant Data from BindingDB
Found 1 hit for monomerid = 50042816
TargetRenin(Homo sapiens (Human))
Warner-Lambert
Curated by ChEMBL
LigandPNGBDBM50042816(CHEMBL127856 | N-[2-(2-Amino-thiazol-4-yl)-1-(1-cy...)
Affinity DataIC50:  7.70nM. Assay description: Inhibitory concentration against renin monkey plasma
In DepthDetails ArticlePubMed