BDBM50042962 (E)-3-(3,4-Dihydroxy-phenyl)-1-(4-hydroxy-phenyl)-propenone::3-(3,4-Dihydroxy-phenyl)-1-(4-hydroxy-phenyl)-propenone::CHEMBL341135
SMILES Oc1ccc(cc1)C(=O)\C=C\c1ccc(O)c(O)c1
InChI Key InChIKey=UPERCWWUZZKHCL-LREOWRDNSA-N
Data  5 IC50
  Tab Delimited (TSV)   2D SDfile   Computed 3D by Vconf -m prep SDfile
Find this compound or compounds like it in BindingDB:
Activity Spreadsheet -- Enzyme Inhibition Constant Data from BindingDB
Found 5 hits for monomerid = 50042962
TargetPolyunsaturated fatty acid 5-lipoxygenase(Rattus norvegicus)
Tokushima Bunri University
Curated by ChEMBL
LigandPNGBDBM50042962((E)-3-(3,4-Dihydroxy-phenyl)-1-(4-hydroxy-phenyl)-...)
Affinity DataIC50:  4nM. Assay description: In vitro inhibition against 5-lipoxygenase in RBL-1 cells was determined
In DepthDetails ArticlePubMed
TargetXanthine dehydrogenase/oxidase(Bos taurus (Bovine))
Northern Kentucky University
Curated by ChEMBL
LigandPNGBDBM50042962((E)-3-(3,4-Dihydroxy-phenyl)-1-(4-hydroxy-phenyl)-...)
Affinity DataIC50:  4.30E+3nM. Assay description: Inhibition of bovine xanthine oxidase assessed as conversion of xanthine to uric acid by spectroscopic analysis
In DepthDetails ArticlePubMed
TargetIntegrase(Human immunodeficiency virus 1)
University Of Tennessee Health Science Center
Curated by ChEMBL
LigandPNGBDBM50042962((E)-3-(3,4-Dihydroxy-phenyl)-1-(4-hydroxy-phenyl)-...)
Affinity DataIC50:  1.29E+3nM. Assay description: Inhibitory activity against HIV-1 Integrase (HIV-1-IN)
In DepthDetails ArticlePubMed
TargetPolyunsaturated fatty acid 5-lipoxygenase(Rattus norvegicus)
Tokushima Bunri University
Curated by ChEMBL
LigandPNGBDBM50042962((E)-3-(3,4-Dihydroxy-phenyl)-1-(4-hydroxy-phenyl)-...)
Affinity DataIC50:  4nM. Assay description: Inhibition of 5-lipoxygenase in rat RBL1 cells
In DepthDetails Article
TargetIntegrase(Human immunodeficiency virus 1)
University Of Tennessee Health Science Center
Curated by ChEMBL
LigandPNGBDBM50042962((E)-3-(3,4-Dihydroxy-phenyl)-1-(4-hydroxy-phenyl)-...)
Affinity DataIC50:  1.30E+3nM. Assay description: Compound concentration required to reduce HIV-1 Integrase 3'-processing activity by 50%
In DepthDetails ArticlePubMed