BDBM50043030 2-Diphenylacetyl-1,2,3,4-tetrahydro-isoquinoline-3-carboxylic acid::CHEMBL128416
SMILES OC(=O)C1Cc2ccccc2CN1C(=O)C(c1ccccc1)c1ccccc1
InChI Key InChIKey=NKSPYRPIQFVDAL-UHFFFAOYSA-N
Data  3 IC50
  Tab Delimited (TSV)   2D SDfile   Computed 3D by Vconf -m prep SDfile
Find this compound or compounds like it in BindingDB:
Activity Spreadsheet -- Enzyme Inhibition Constant Data from BindingDB
Found 3 hits for monomerid = 50043030
TargetType-2 angiotensin II receptor(RAT)
Dupont Pharmaceuticals
Curated by ChEMBL
LigandPNGBDBM50043030(2-Diphenylacetyl-1,2,3,4-tetrahydro-isoquinoline-3...)
Affinity DataIC50:  2.50E+3nM. Assay description: Binding affinity towards Angiotensin II receptor, type 2 in rat isolated adrenal medullary microsomes
In DepthDetails ArticlePubMed
TargetType-1 angiotensin II receptor A/B(RAT)
Dupont Pharmaceuticals
Curated by ChEMBL
LigandPNGBDBM50043030(2-Diphenylacetyl-1,2,3,4-tetrahydro-isoquinoline-3...)
Affinity DataIC50: >3.00E+4nM. Assay description: Binding affinity towards Angiotensin II receptor, type 1 in rat isolated adrenal cortical microsomes
In DepthDetails ArticlePubMed
TargetType-2 angiotensin II receptor(Homo sapiens (Human))
TBA
Curated by ChEMBL
LigandPNGBDBM50043030(2-Diphenylacetyl-1,2,3,4-tetrahydro-isoquinoline-3...)
Affinity DataIC50:  200nM. Assay description: Inhibitory activity against angiotensin II type 2 (AT2) receptor in rabbit uterine membranes.
In DepthDetails Article