BDBM50043040 2-Diphenylacetyl-5-(4-methoxy-benzyl)-1,2,3,4-tetrahydro-isoquinoline-3-carboxylic acid methyl ester::CHEMBL128233
SMILES COC(=O)C1Cc2c(Cc3ccc(OC)cc3)cccc2CN1C(=O)C(c1ccccc1)c1ccccc1
InChI Key InChIKey=RANSNVVVJGRXFI-UHFFFAOYSA-N
Data  2 IC50
  Tab Delimited (TSV)   2D SDfile   Computed 3D by Vconf -m prep SDfile
Find this compound or compounds like it in BindingDB:
Activity Spreadsheet -- Enzyme Inhibition Constant Data from BindingDB
Found 2 hits for monomerid = 50043040
TargetType-1 angiotensin II receptor A/B(RAT)
Dupont Pharmaceuticals
Curated by ChEMBL
LigandPNGBDBM50043040(2-Diphenylacetyl-5-(4-methoxy-benzyl)-1,2,3,4-tetr...)
Affinity DataIC50: >1.00E+4nM. Assay description: Binding affinity towards Angiotensin II receptor, type 1 in rat isolated adrenal cortical microsomes
In DepthDetails ArticlePubMed
TargetType-2 angiotensin II receptor(RAT)
Dupont Pharmaceuticals
Curated by ChEMBL
LigandPNGBDBM50043040(2-Diphenylacetyl-5-(4-methoxy-benzyl)-1,2,3,4-tetr...)
Affinity DataIC50: >1.00E+4nM. Assay description: Binding affinity towards Angiotensin II receptor, type 2 in rat isolated adrenal medullary microsomes
In DepthDetails ArticlePubMed